起步软件技术论坛
搜索
 找回密码
 注册

QQ登录

只需一步,快速开始

楼主: liangshaohua

[分享] App打包常见报错

  [复制链接]

1

主题

2

帖子

9

积分

新手上路

Rank: 1

积分
9
QQ
发表于 2018-11-20 20:04:46 | 显示全部楼层

开始......
   
保存配置信息:
   
编译UI资源:
   
清除编译环境:
   
复制模版工程:
   
复制工程:
   
复制插件:
   
复制WWW资源:
   
更新工程信息:
   
增加插件:
   使用到的插件: [cordova-plugin-whitelist, cordova-plugin-splashscreen, cordova-plugin-app-preferences,

com.justep.cordova.plugin.app.utils]
   开始安装插件......
   开始准备插件参数......
   插件 "cordova-plugin-splashscreen" 参数如下:
   插件 "cordova-plugin-app-preferences" 参数如下:
   插件 "cordova-plugin-file" 参数如下:
   插件 "cordova-plugin-file-transfer" 参数如下:
   插件 "cordova-plugin-network-information" 参数如下:
   插件 "cordova-plugin-zip" 参数如下:
   插件 "cordova-plugin-inappbrowser" 参数如下:
   插件 "cordova-plugin-x-toast" 参数如下:
   插件 "com.justep.cordova.plugin.app.utils" 参数如下:
   插件参数准备完成
   Installing "cordova-plugin-splashscreen" for android
   Failed to install 'cordova-plugin-splashscreen':Error: spawn UNKNOWN
       at exports._errnoException (util.js:870:11)
       at ChildProcess.spawn (internal/child_process.js:298:11)
       at Object.exports.spawn (child_process.js:362:9)
       at Object.exports.spawn (E:\BaiduNetdiskDownload\WeX5V35\tools\cordova\node_modules\cordova-lib

\node_modules\cordova-common\src\superspawn.js:108:31)
       at Object.exports.maybeSpawn (E:\BaiduNetdiskDownload\WeX5V35\tools\cordova\node_modules\cordova-lib

\node_modules\cordova-common\src\superspawn.js:150:24)
       at E:\BaiduNetdiskDownload\WeX5V35\tools\cordova\node_modules\cordova-lib\src\plugman\install.js:319:29
       at _fulfilled (E:\BaiduNetdiskDownload\WeX5V35\tools\cordova\node_modules\q\q.js:787:54)
       at self.promiseDispatch.done (E:\BaiduNetdiskDownload\WeX5V35\tools\cordova\node_modules\q\q.js:816:30)
       at Promise.promise.promiseDispatch (E:\BaiduNetdiskDownload\WeX5V35\tools\cordova\node_modules\q

\q.js:749:13)
       at E:\BaiduNetdiskDownload\WeX5V35\tools\cordova\node_modules\q\q.js:810:14
   Error: spawn UNKNOWN
****ERROR****: 子任务 "addPlugins" 执行失败。
****ERROR****: 任务 "addPlugins" 执行失败。
****ERROR****: 执行出错:
****ERROR****: 错误信息: addPlugins returned: 1
****ERROR****: 如不能确定具体问题,可参考常见问题: http://bbs.wex5.com/thread-82002-1-1.html
回复 支持 反对

使用道具 举报

0

主题

1

帖子

10

积分

新手上路

Rank: 1

积分
10
QQ
发表于 2018-11-24 23:12:54 | 显示全部楼层
本帖最后由 t1094177531 于 2018-11-24 23:27 编辑

2018-11-24 22:52:09 [Thread-36] [org.apache.tools.ant.UnknownElement]错误:任务“java”以错误结束。
C:\ Users \ ADMINI~1 \ AppData \ Local \ Temp \ x5app-build2893837638507341045.xml:284:Java返回:-3
        atg.apache.tools.ant.taskdefs.Java.execute(Java.java:111)
        at org.apache.tools.ant.UnknownElement.execute(UnknownElement.java:292)
        at sun.reflect.GeneratedMethodAccessor19.invoke (Unknown Source)
        at sun.reflect.DelegatingMethodAccessorImpl.invoke(DelegatingMethodAccessorImpl.java:43)
        at java.lang。反映.Method.invoke(Method.java:497)
        org.apache.tools.ant.dispatch.DispatchUtils.execute(DispatchUtils.java:106)
        org.apache.tools.ant.Task.perform(Task.java: 348)
        在org.apache.tools.ant.Target.execute(Target.java:435)
        在org.apache.tools.ant.Target.performTasks(Target.java:456)
        在org.apache.tools.ant.Project.executeSortedTargets (Project.java:1393)
        在org.apache.tools.ant.Project.executeTarget(Project.java:1364)
        在Pack.execTask(Pack.java:53)
        在Pack.access $ 000(Pack.java:24)
        在
        在java.lang.Thread.run(Thread.java:745)
2018-11-24 22:52:09 [Thread-36] [org.apache.tools.ant。包装$ 1.run(Pack.java:84)。目标]错误:目标“prepareSource”已完成错误。
C:\ Users \ ADMINI~1 \ AppData \ Local \ Temp \ x5app-build2893837638507341045.xml:284:Java返回:-3
        atg.apache.tools.ant.taskdefs.Java.execute(Java.java:111)
        在or.apache.tools.ant.UnknownElement.execute(UnknownElement.java:292)
        at sun.reflect.GeneratedMethodAccessor19.invoke (Unknown Source)
        at sun.reflect.DelegatingMethodAccessorImpl.invoke(DelegatingMethodAccessorImpl.java:43)
        at java.lang .reflect.Method.invoke(Method.java:497)
        在org.apache.tools.ant.dispatch.DispatchUtils.execute(DispatchUtils.java:106)
        在org.apache.tools.ant.Task.perform(Task.java :348)
        org.apache.tools.ant.Target.execute(Target.java:435)
        位于org.apache.tools.ant的org.apache.tools.ant.Target.performTasks(Target.java:456)
        。 Project.executeSortedTargets(Project.java:1393)
        在        Pack.access $ 000(Pack.java:24)的
        Pack.exe.Tun(Pack.java:24)上的org.apache.tools.ant.Project.executeTarget(Project.java:1364)        Pack $ 1.run(Pack。 java:84)        at java.lang.Thread.run(Thread.java:745) 2018-11-24 22:52:09 [Thread-36] [org.apache.tools.ant.Project]错误:构建完成错误。C:\ Users \ ADMINI~1 \ AppData \ Local \ Temp \ x5app-build2893837638507341045.xml:284:Java返回:-3         atg.apache.tools.ant.taskdefs.Java.execute(Java.java:111)        at org.apache.tools.ant.UnknownElement.execute(UnknownElement.java:292)        at sun.reflect.GeneratedMethodAccessor19.invoke (Unknown Source)








        在
        sun.reflect.DelegatingMethodAccessorImpl.invoke (DelegatingMethodAccessorImpl.java:43)at java.lang.reflect.Method.invoke(Method.java:497)
        org.apache.tools.ant.dispatch.DispatchUtils.execute(DispatchUtils.java) :106)
        org.apache.tools.ant.Task.perform(Task.java:348)
        org.apache.tools.ant.Target.execute(Target.java:435)atg.apache.tools.ant
        。在。org.apache.tools.ant.Project.executeTarget(
        Project.java:1364)
        的org.apache.tools.ant.Project.executeSortedTargets(Project.java:1393)
        上的Target.performTasks(Target.java:456)Pack.access
        $ 000(Pack.java:24)的
        .execTask(Pack.java:53)打包$ 1.run(Pack.java:84)
        在java.lang.Thread.run(Thread.java:745)
---------------------打包日志:
   位置:类百度位置
      D:\ java \ wex5 \ model \ Native \外卖\ build \ src \ platforms \ android \ src \ com \ justep \ cordova \ plugin \ baidulocation \ BaiduLocation.java:177:错误:找不到符号
            Intent intent = new Intent(Settings.ACTION_LOCATION_SOURCE_SETTINGS);
                                ^
        符号:类意图
        位置:类百度位置
      D:\ java \ wex5 \ model \ Native \外卖\ build \ src \ platforms \ android \ src \ com \ justep \ cordova \ plugin \ baidulocation \ BaiduLocation.java:177:错误:找不到符号
            Intent intent = new Intent(Settings.ACTION_LOCATION_SOURCE_SETTINGS);
                                       ^
        符号:变量设置
        位置:类百度位置
      注:某些输入文件使用或覆盖了已过时的API。
      注:有关详细信息,请使用-Xlint:deprecation重新编译。
      注:某些输入文件使用了未经检查或不安全的操作。
      注:有关详细信息,请使用-Xlint:unchecked重新编译。
      11个错误

      FAILURE:构建因异常而失败。

回复 支持 反对

使用道具 举报

2

主题

13

帖子

23

积分

新手上路

Rank: 1

积分
23
QQ
发表于 2019-1-11 17:23:12 | 显示全部楼层
You have been opted out of telemetry. To change this, run: cordova telemetry on.
      args.nofetch undefined
      android project rename compelete!!!!!!
      ios project rename compelete!!!!!!
      Error: The product name change (<name> tag) in config.xml is not supported dynamically.
      To change your product name, you have to remove, then add your ios platform again.
      Make sure you save your plugins beforehand using `cordova plugin save`.
   /var/folders/dh/87lyj9cd2nx3tlw2tq_rt0jh0000gn/T/2a148f8c-fabd-4952-80ed-ed664bfded98/genSource.xml:149: /var/folders/dh/87lyj9cd2nx3tlw2tq_rt0jh0000gn/T/2a148f8c-fabd-4952-80ed-ed664bfded98/genSource.xml:149: UpdateSource returned: 1
              cordova plugin save
              cordova platform rm ios
              cordova platform add ios
      
           at com.justep.tools.ant.task.app.UpdateSourceTask.execute(Unknown Source)
           at org.apache.tools.ant.UnknownElement.execute(UnknownElement.java:292)
   ****ERROR****: 子任务 "UpdateSource" 执行失败。
   ****ERROR****: 任务 "updateProject" 执行失败。
   ****ERROR****: 执行出错:
           at sun.reflect.GeneratedMethodAccessor4.invoke(Unknown Source)
           at sun.reflect.DelegatingMethodAccessorImpl.invoke(DelegatingMethodAccessorImpl.java:43)
           at java.lang.reflect.Method.invoke(Method.java:497)
   ****ERROR****: 错误信息: /var/folders/dh/87lyj9cd2nx3tlw2tq_rt0jh0000gn/T/2a148f8c-fabd-4952-80ed-ed664bfded98/genSource.xml:149: UpdateSource returned: 1        at org.apache.tools.ant.dispatch.DispatchUtils.execute(DispatchUtils.java:106)
   ****ERROR****: 如不能确定具体问题,可参考常见问题: http://bbs.wex5.com/thread-82002-1-1.html
   
           at org.apache.tools.ant.Task.perform(Task.java:348)
           at org.apache.tools.ant.Target.execute(Target.java:435)
           at org.apache.tools.ant.Target.performTasks(Target.java:456)
           at org.apache.tools.ant.Project.executeSortedTargets(Project.java:1393)
           at org.apache.tools.ant.Project.executeTarget(Project.java:1364)
           at com.justep.deploy.app.utils.BuildHelper.execTask(Unknown Source)
           at com.justep.deploy.app.utils.Builder.main(Unknown Source)
   Caused by: /var/folders/dh/87lyj9cd2nx3tlw2tq_rt0jh0000gn/T/2a148f8c-fabd-4952-80ed-ed664bfded98/genSource.xml:149: UpdateSource returned: 1
           at com.justep.tools.ant.task.app.UpdateSourceTask.a(Unknown Source)
           ... 13 more
****ERROR****: 子任务 "java" 执行失败。
****ERROR****: 任务 "prepareSource" 执行失败。
****ERROR****: 执行出错:
****ERROR****: 错误信息: Java returned: 253
****ERROR****: 如不能确定具体问题,可参考常见问题: http://bbs.wex5.com/thread-82002-1-1.html

求大神解答谢谢
回复 支持 反对

使用道具 举报

2

主题

13

帖子

23

积分

新手上路

Rank: 1

积分
23
QQ
发表于 2019-1-11 17:26:47 | 显示全部楼层
You have been opted out of telemetry. To change this, run: cordova telemetry on.
      args.nofetch undefined
      android project rename compelete!!!!!!
      ios project rename compelete!!!!!!
      Error: The product name change (<name> tag) in config.xml is not supported dynamically.
      To change your product name, you have to remove, then add your ios platform again.
      Make sure you save your plugins beforehand using `cordova plugin save`.
   /var/folders/dh/87lyj9cd2nx3tlw2tq_rt0jh0000gn/T/2a148f8c-fabd-4952-80ed-ed664bfded98/genSource.xml:149: /var/folders/dh/87lyj9cd2nx3tlw2tq_rt0jh0000gn/T/2a148f8c-fabd-4952-80ed-ed664bfded98/genSource.xml:149: UpdateSource returned: 1
              cordova plugin save
              cordova platform rm ios
              cordova platform add ios
      
           at com.justep.tools.ant.task.app.UpdateSourceTask.execute(Unknown Source)
           at org.apache.tools.ant.UnknownElement.execute(UnknownElement.java:292)
   ****ERROR****: 子任务 "UpdateSource" 执行失败。
   ****ERROR****: 任务 "updateProject" 执行失败。
   ****ERROR****: 执行出错:
           at sun.reflect.GeneratedMethodAccessor4.invoke(Unknown Source)
           at sun.reflect.DelegatingMethodAccessorImpl.invoke(DelegatingMethodAccessorImpl.java:43)
           at java.lang.reflect.Method.invoke(Method.java:497)
   ****ERROR****: 错误信息: /var/folders/dh/87lyj9cd2nx3tlw2tq_rt0jh0000gn/T/2a148f8c-fabd-4952-80ed-ed664bfded98/genSource.xml:149: UpdateSource returned: 1        at org.apache.tools.ant.dispatch.DispatchUtils.execute(DispatchUtils.java:106)
   ****ERROR****: 如不能确定具体问题,可参考常见问题: http://bbs.wex5.com/thread-82002-1-1.html
   
           at org.apache.tools.ant.Task.perform(Task.java:348)
           at org.apache.tools.ant.Target.execute(Target.java:435)
           at org.apache.tools.ant.Target.performTasks(Target.java:456)
           at org.apache.tools.ant.Project.executeSortedTargets(Project.java:1393)
           at org.apache.tools.ant.Project.executeTarget(Project.java:1364)
           at com.justep.deploy.app.utils.BuildHelper.execTask(Unknown Source)
           at com.justep.deploy.app.utils.Builder.main(Unknown Source)
   Caused by: /var/folders/dh/87lyj9cd2nx3tlw2tq_rt0jh0000gn/T/2a148f8c-fabd-4952-80ed-ed664bfded98/genSource.xml:149: UpdateSource returned: 1
           at com.justep.tools.ant.task.app.UpdateSourceTask.a(Unknown Source)
           ... 13 more
****ERROR****: 子任务 "java" 执行失败。
****ERROR****: 任务 "prepareSource" 执行失败。
****ERROR****: 执行出错:
****ERROR****: 错误信息: Java returned: 253
****ERROR****: 如不能确定具体问题,可参考常见问题: http://bbs.wex5.com/thread-82002-1-1.html
回复 支持 反对

使用道具 举报

1

主题

3

帖子

11

积分

新手上路

Rank: 1

积分
11
QQ
发表于 2019-6-5 13:37:49 | 显示全部楼层
ios打包。怎么样才能正确引入framework呢,我现在是在plugin.xml中<framework src="src/ios/libs/CMMapKit.framework" custom="true" />这样写的

build.log.zip

26.93 KB, 下载次数: 10

回复 支持 反对

使用道具 举报

0

主题

4

帖子

10

积分

新手上路

Rank: 1

积分
10
QQ
发表于 2019-6-6 10:17:32 | 显示全部楼层
459857070 发表于 2016-2-22 15:08
请问这个怎么解决
插件 "com.justep.cordova.plugin.alipay" 参数如下:
****ERROR****: 子任务 "addPlugin ...

你这问题解决了吗我现在也遇到了
回复 支持 反对

使用道具 举报

3

主题

16

帖子

32

积分

新手上路

Rank: 1

积分
32
QQ
发表于 2019-6-10 09:18:09 | 显示全部楼层
[java] ****ERROR****: 子任务 "DeployLogAndStatus" 执行失败。
12:47:32      [java] ****ERROR****: 任务 "deploy-normal" 执行失败。
12:47:32      [java] ****ERROR****: 执行出错:
12:47:32      [java] ****ERROR****: 错误信息: 等待部署状态超时!
12:47:32      [java] ****ERROR****: 如不能确定具体问题,可参考常见问题: http://bbs.wex5.com/thread-82002-1-1.html
12:47:32      [java] /tmp/4b4381de-3004-426f-80a9-19c80aedc54c/deploy.xml:57: 等待部署状态超时!
12:47:32      [java]         at com.justep.tools.ant.task.paas.DeployStatusTask.a(Unknown Source)
12:47:32      [java]         at com.justep.tools.ant.task.paas.DeployStatusTask.execute(Unknown Source)
12:47:32      [java]         at org.apache.tools.ant.UnknownElement.execute(UnknownElement.java:292)
12:47:32      [java]         at sun.reflect.GeneratedMethodAccessor4.invoke(Unknown Source)
12:47:32      [java]         at sun.reflect.DelegatingMethodAccessorImpl.invoke(DelegatingMethodAccessorImpl.java:43)
12:47:32      [java]         at java.lang.reflect.Method.invoke(Method.java:498)
12:47:32      [java]         at org.apache.tools.ant.dispatch.DispatchUtils.execute(DispatchUtils.java:106)
12:47:32      [java]         at org.apache.tools.ant.Task.perform(Task.java:348)
12:47:32      [java]         at org.apache.tools.ant.Target.execute(Target.java:435)
12:47:32      [java]         at org.apache.tools.ant.Target.performTasks(Target.java:456)
12:47:32      [java]         at org.apache.tools.ant.Project.executeSortedTargets(Project.java:1393)
12:47:32      [java]         at org.apache.tools.ant.Project.executeTarget(Project.java:1364)
12:47:32      [java]         at com.justep.deploy.app.utils.BuildHelper.execTask(Unknown Source)
12:47:32      [java]         at com.justep.deploy.app.utils.Builder.main(Unknown Source)
12:47:32
12:47:32 BUILD FAILED
12:47:32 /usr/local/tomcat/temp/x5app-build6188497146311136786.xml:471: Java returned: 253
12:47:32
12:47:32 Total time: 19 minutes 1 second
12:47:32 Build step 'Invoke Ant' marked build as failure
12:47:32 Finished: FAILURE
回复 支持 反对

使用道具 举报

17

主题

141

帖子

374

积分

中级会员

Rank: 3Rank: 3

积分
374
QQ
发表于 2019-6-26 15:05:45 | 显示全部楼层
本帖最后由 Fancye 于 2019-6-26 15:08 编辑

MAC 笔记本打包Android报错,打包 IOS 正常。
  1. FAILURE: Build failed with an exception.
  2.       
  3.       * What went wrong:
  4.       Execution failed for task ':processReleaseResources'.
  5.       > com.android.ide.common.process.ProcessException: org.gradle.process.internal.ExecException: Process 'command '/Users/computech/Desktop/WeX5_V3.6-mac/tools/adt-sdk/build-tools/22.0.1/aapt'' finished with non-zero exit value 1
  6.       
  7.       * Try:
  8.       Run with --stacktrace option to get the stack trace. Run with --info or --debug option to get more log output.
  9.       :processReleaseResources FAILED
  10.       
  11.       BUILD FAILED
  12.       
  13.       Total time: 14.808 secs
  14.       ERROR building one of the platforms: Error: /Users/computech/Desktop/WeX5_V3.6-mac/model/Native/千里眼(240.11)/build/src/platforms/android/cordova/build: Command failed with exit code 1
  15.       You may not have the required environment or OS to build this project
  16.       
  17.       /Users/computech/Desktop/WeX5_V3.6-mac/model/Native/千里眼(240.11)/build/src/platforms/android/cordova/node_modules/q/q.js:126
  18.                           throw e;
  19.                           ^
  20.       Error code 1 for command: /Users/computech/Desktop/WeX5_V3.6-mac/model/Native/千里眼(240.11)/build/src/platforms/android/gradlew with args: cdvBuildRelease,-b,/Users/computech/Desktop/WeX5_V3.6-mac/model/Native/千里眼(240.11)/build/src/platforms/android/build.gradle,-Dorg.gradle.daemon=true,--offline
  21.       Error: /Users/computech/Desktop/WeX5_V3.6-mac/model/Native/千里眼(240.11)/build/src/platforms/android/cordova/build: Command failed with exit code 1
  22.    ****ERROR****: 子任务 "exec" 执行失败。
  23.    ****ERROR****: 任务 "buildAndroid" 执行失败。
  24.    ****ERROR****: 执行出错:
  25.    ****ERROR****: 错误信息: exec returned: 1
  26.    ****ERROR****: 如不能确定具体问题,可参考常见问题: http://bbs.wex5.com/thread-82002-1-1.html
  27.    /var/folders/bv/_sm2_5_519xdmsgk8s5yz1sm0000gn/T/ec58a4bc-9375-483b-b9ec-3c20b427225b/pack.xml:88: exec returned: 1
  28.            at org.apache.tools.ant.taskdefs.ExecTask.runExecute(ExecTask.java:643)
  29.            at org.apache.tools.ant.taskdefs.ExecTask.runExec(ExecTask.java:669)
  30.            at org.apache.tools.ant.taskdefs.ExecTask.execute(ExecTask.java:495)
  31.            at org.apache.tools.ant.UnknownElement.execute(UnknownElement.java:292)
  32.            at sun.reflect.GeneratedMethodAccessor4.invoke(Unknown Source)
  33.            at sun.reflect.DelegatingMethodAccessorImpl.invoke(DelegatingMethodAccessorImpl.java:43)
  34.            at java.lang.reflect.Method.invoke(Method.java:497)
  35.            at org.apache.tools.ant.dispatch.DispatchUtils.execute(DispatchUtils.java:106)
  36.            at org.apache.tools.ant.Task.perform(Task.java:348)
  37.            at org.apache.tools.ant.Target.execute(Target.java:435)
  38.            at org.apache.tools.ant.Target.performTasks(Target.java:456)
  39.            at org.apache.tools.ant.Project.executeSortedTargets(Project.java:1393)
  40.            at org.apache.tools.ant.Project.executeTarget(Project.java:1364)
  41.            at com.justep.deploy.app.utils.BuildHelper.execTask(Unknown Source)
  42.            at com.justep.deploy.app.utils.Builder.main(Unknown Source)
  43. ****ERROR****: 子任务 "java" 执行失败。
  44. ****ERROR****: 任务 "pack" 执行失败。
  45. ****ERROR****: 执行出错:
  46. ****ERROR****: 错误信息: Java returned: 253
  47. ****ERROR****: 如不能确定具体问题,可参考常见问题: http://bbs.wex5.com/thread-82002-1-1.html
复制代码



回复 支持 反对

使用道具 举报

17

主题

141

帖子

374

积分

中级会员

Rank: 3Rank: 3

积分
374
QQ
发表于 2019-6-27 09:35:19 | 显示全部楼层
  1. 更新工程信息:
  2.    ****ERROR****: 子任务 "updateSource" 执行失败。
  3.    ****ERROR****: 任务 "updateProject" 执行失败。
  4.    ****ERROR****: 执行出错:
  5.    ****ERROR****: 错误信息: C:\Users\Fancye\AppData\Local\Temp\a7c81e8a-c324-49e2-9674-e4140fec56b7\genSource.xml:104: updateSource returned: 1
  6.    ****ERROR****: 如不能确定具体问题,可参考常见问题: http://bbs.wex5.com/thread-82002-1-1.html
  7.    C:\Users\Fancye\AppData\Local\Temp\a7c81e8a-c324-49e2-9674-e4140fec56b7\genSource.xml:104: C:\Users\Fancye\AppData\Local\Temp\a7c81e8a-c324-49e2-9674-e4140fec56b7\genSource.xml:104: updateSource returned: 1
  8.            at com.justep.tools.ant.task.app.UpdateSourceTask.execute(Unknown Source)
  9.            at org.apache.tools.ant.UnknownElement.execute(UnknownElement.java:292)
  10.            at sun.reflect.GeneratedMethodAccessor4.invoke(Unknown Source)
  11.            at sun.reflect.DelegatingMethodAccessorImpl.invoke(DelegatingMethodAccessorImpl.java:43)
  12.            at java.lang.reflect.Method.invoke(Method.java:497)
  13.            at org.apache.tools.ant.dispatch.DispatchUtils.execute(DispatchUtils.java:106)
  14.            at org.apache.tools.ant.Task.perform(Task.java:348)
  15.            at org.apache.tools.ant.Target.execute(Target.java:435)
  16.            at org.apache.tools.ant.Target.performTasks(Target.java:456)
  17.            at org.apache.tools.ant.Project.executeSortedTargets(Project.java:1393)
  18.            at org.apache.tools.ant.Project.executeTarget(Project.java:1364)
  19.            at com.justep.deploy.app.utils.BuildHelper.execTask(Unknown Source)
  20.            at com.justep.deploy.app.utils.Builder.main(Unknown Source)
  21.    Caused by: C:\Users\Fancye\AppData\Local\Temp\a7c81e8a-c324-49e2-9674-e4140fec56b7\genSource.xml:104: updateSource returned: 1
  22.            at com.justep.tools.ant.task.app.UpdateSourceTask.a(Unknown Source)
  23.            ... 13 more
  24. ****ERROR****: 子任务 "java" 执行失败。
  25. ****ERROR****: 任务 "prepareSource" 执行失败。
  26. ****ERROR****: 执行出错:
  27. ****ERROR****: 错误信息: Java returned: -3
  28. ****ERROR****: 如不能确定具体问题,可参考常见问题: http://bbs.wex5.com/thread-82002-1-1.html
复制代码
回复 支持 反对

使用道具 举报

0

主题

1

帖子

5

积分

新手上路

Rank: 1

积分
5
QQ
发表于 2019-7-4 14:28:25 | 显示全部楼层
****ERROR****: 子任务 "java" 执行失败。
****ERROR****: 任务 "compileUI2" 执行失败。
****ERROR****: 执行出错:
****ERROR****: 错误信息: Java returned: -3
****ERROR****: 如不能确定具体问题,可参考常见问题: http://bbs.wex5.com/thread-82002-1-1.html
这个怎么办啊
回复 支持 反对

使用道具 举报

您需要登录后才可以回帖 登录 | 注册

本版积分规则

小黑屋|手机版|X3技术论坛|Justep Inc.    

GMT+8, 2019-7-21 04:22 , Processed in 0.356083 second(s), 25 queries .

Powered by Discuz! X3.1

© 2001-2013 Comsenz Inc.

快速回复 返回顶部 返回列表