起步软件技术论坛
搜索
 找回密码
 注册

QQ登录

只需一步,快速开始

楼主: tiger_lixy

[结贴] https打包app问题

  [复制链接]

6

主题

15

帖子

95

积分

初级会员

Rank: 2

积分
95
QQ
发表于 2018-5-23 15:39:46 | 显示全部楼层
jishuang 发表于 2018-5-23 11:20
把Build.VERSION_CODES.N改为23再打包看看

3.6   打ios包不支持https吗   为什么我刚刚打的包访问不了啊   tomcat没有收到任何请求
回复 支持 反对

使用道具 举报

86

主题

12万

帖子

2万

积分

管理员

Rank: 9Rank: 9Rank: 9

积分
27591
发表于 2018-5-23 16:29:22 | 显示全部楼层
用下面的案例测试看看

fileTransferDownload.zip

3.81 KB, 下载次数: 67

远程的联系方法QQ1392416607,添加好友时,需在备注里注明其论坛名字及ID,公司等信息
发远程时同时也发一下帖子地址,方便了解要解决的问题  WeX5教程  WeX5下载



如按照该方法解决,请及时跟帖,便于版主结贴
回复 支持 反对

使用道具 举报

19

主题

98

帖子

256

积分

中级会员

Rank: 3Rank: 3

积分
256
QQ
 楼主| 发表于 2018-5-23 17:22:50 | 显示全部楼层
我们是根本还打不开登录页面呢。卡在了logo页面,一直转圈。
回复 支持 反对

使用道具 举报

86

主题

12万

帖子

2万

积分

管理员

Rank: 9Rank: 9Rank: 9

积分
27591
发表于 2018-5-23 17:26:22 | 显示全部楼层
这个地方就没有用到这个插件,应该不是这个插件的问题,替换会原来的插件打包就可以?
远程的联系方法QQ1392416607,添加好友时,需在备注里注明其论坛名字及ID,公司等信息
发远程时同时也发一下帖子地址,方便了解要解决的问题  WeX5教程  WeX5下载



如按照该方法解决,请及时跟帖,便于版主结贴
回复 支持 反对

使用道具 举报

19

主题

98

帖子

256

积分

中级会员

Rank: 3Rank: 3

积分
256
QQ
 楼主| 发表于 2018-5-23 17:46:36 | 显示全部楼层
本帖最后由 tiger_lixy 于 2018-5-23 17:51 编辑

注意:现在我在问iosapp的问题。安卓app问题已经解决了
用https协议头就会这样。
回复 支持 反对

使用道具 举报

3

主题

304

帖子

798

积分

高级会员

Rank: 4

积分
798
QQ
发表于 2018-5-23 18:52:03 | 显示全部楼层
tiger_lixy 发表于 2018-5-23 17:46
注意:现在我在问iosapp的问题。安卓app问题已经解决了
用https协议头就会这样。 ...

你找到这个文件/model/Native/templates/advanced/platforms/ios/X5/Classes/AppDelegate.m  
然后找到这行代码
@implementation AppDelegate
在这行代码前面插入这段代码(记得是代码的前面插入)
@implementation NSURLRequest(DataController)
+ (BOOL)allowsAnyHTTPSCertificateForHostNSString *)host {
    return YES;
}
@end
重新打包可以解决你的问题。
回复 支持 反对

使用道具 举报

3

主题

304

帖子

798

积分

高级会员

Rank: 4

积分
798
QQ
发表于 2018-5-23 18:52:42 | 显示全部楼层
jleeh 发表于 2018-5-23 18:52
你找到这个文件/model/Native/templates/advanced/platforms/ios/X5/Classes/AppDelegate.m  
然后找到这 ...

@implementation NSURLRequest(DataController)
+ (BOOL)allowsAnyHTTPSCertificateForHostNSString *)host {
    return YES;
}
@end
回复 支持 反对

使用道具 举报

19

主题

98

帖子

256

积分

中级会员

Rank: 3Rank: 3

积分
256
QQ
 楼主| 发表于 2018-5-24 16:34:47 | 显示全部楼层
jleeh 发表于 2018-5-23 18:52
@implementation NSURLRequest(DataController)
+ (BOOL)allowsAnyHTTPSCertificateForHostNSString *)ho ...

打包失败,好像上面代码不全吧?至少少了一个左括号。
回复 支持 反对

使用道具 举报

3

主题

304

帖子

798

积分

高级会员

Rank: 4

积分
798
QQ
发表于 2018-5-24 16:46:58 | 显示全部楼层
tiger_lixy 发表于 2018-5-24 16:34
打包失败,好像上面代码不全吧?至少少了一个左括号。

这样的
屏幕快照 2018-05-24 下午4.43.59.png
回复 支持 反对

使用道具 举报

19

主题

98

帖子

256

积分

中级会员

Rank: 3Rank: 3

积分
256
QQ
 楼主| 发表于 2018-5-25 11:47:05 | 显示全部楼层
还是报错,错误日志摘要:
[java]    /Volumes/X5/WeX5_V3.6-mac/.packer/C7ADD9ABC0700001478DE8C919401ECE/14/src/platforms/ios/***/Classes/AppDelegate.m:34:9: error: expected selector for Objective-C method
     [java]    + (BOOL)(allowsAnyHTTPSCertificateForHost:(NSString *)host {
     [java]    ~~~~~~~~^
     [java]    /Volumes/X5/WeX5_V3.6-mac/.packer/C7ADD9ABC0700001478DE8C919401ECE/14/src/platforms/ios/***/Classes/AppDelegate.m:182:5: error: expected method body
     [java]    @end
     [java]        ^
     [java]    /Volumes/X5/WeX5_V3.6-mac/.packer/C7ADD9ABC0700001478DE8C919401ECE/14/src/platforms/ios/***/Classes/AppDelegate.m:182:5: error: missing '@end'
     [java]    @end
     [java]        ^
     [java]    /Volumes/X5/WeX5_V3.6-mac/.packer/C7ADD9ABC0700001478DE8C919401ECE/14/src/platforms/ios/***/Classes/AppDelegate.m:33:1: note: implementation started here
     [java]    @implementation NSURLRequest(DataController)
     [java]    ^
     [java]    3 errors generated.
     [java]   
     [java]    ERROR building one of the platforms: Error: /Volumes/X5/WeX5_V3.6-mac/.packer/C7ADD9ABC0700001478DE8C919401ECE/14/src/platforms/ios/cordova/build: Command failed with exit code 2
     [java]    You may not have the required environment or OS to build this project
     [java]    ** BUILD FAILED **
回复 支持 反对

使用道具 举报

您需要登录后才可以回帖 登录 | 注册

本版积分规则

小黑屋|手机版|X3技术论坛|Justep Inc.    

GMT+8, 2019-5-20 23:25 , Processed in 0.160818 second(s), 26 queries .

Powered by Discuz! X3.1

© 2001-2013 Comsenz Inc.

快速回复 返回顶部 返回列表